Reaction Details
TargetNAD-dependent protein deacetylase sirtuin-2
LigandBDBM50216687
Substrate/Competitorn/a
Meas. Tech.ChEMBL_437199 (CHEMBL906597)
IC50>50000±n/a nM
Citation Outeiro, TFKontopoulos, EAltmann, SMKufareva, IStrathearn, KEAmore, AMVolk, CBMaxwell, MMRochet, JCMcLean, PJYoung, ABAbagyan, RFeany, MBHyman, BTKazantsev, AG Sirtuin 2 inhibitors rescue alpha-synuclein-mediated toxicity in models of Parkinson's disease. Science317:516-9 (2007) 
 
NAD-dependent protein deacetylase sirtuin-2
Name:NAD-dependent protein deacetylase sirtuin-2
Type:Hydrolase
Mol. Mass.:43172.62
Organism:Homo sapiens (Human)
Description:n/a
Residue:389
BDBM50216687
NameBDBM50216687
Synonyms:2-cyano-N-(quinolin-8-yl)-3-(5-(3-(trifluoromethyl)phenyl)furan-2-yl)acrylamide | CHEMBL225914
TypeSmall organic molecule
Emp. Form.C24H14F3N3O2
Mol. Mass.433.3821
SMILESFC(F)(F)c1cccc(c1)-c1ccc(\C=C(/C#N)C(=O)Nc2cccc3cccnc23)o1