Reaction Details
TargetBone morphogenetic protein 1
LigandBDBM50216805
Substrate/Competitorn/a
Meas. Tech.ChEMBL_440136 (CHEMBL890447)
IC50 15±n/a nM
Citation Fish, PVAllan, GABailey, SBlagg, JButt, RCollis, MGGreiling, DJames, KKendall, JMcElroy, AMcCleverty, DReed, CWebster, RWhitlock, GA Potent and selective nonpeptidic inhibitors of procollagen C-proteinase. J Med Chem50:3442-56 (2007) 
 
Bone morphogenetic protein 1
Name:Bone morphogenetic protein 1
Type:PROTEIN
Mol. Mass.:111254.03
Organism:Homo sapiens (Human)
Description:ChEMBL_518962
Residue:986
BDBM50216805
NameBDBM50216805
Synonyms:(3R)-6-cyclohexyl-3-[3-(1,1-dioxido-2-isothiazolidinyl)-1,2,4-oxadiazol-5-yl]-Nhydroxyhexanamide | CHEMBL227153
TypeSmall organic molecule
Emp. Form.C18H30N4O5S
Mol. Mass.414.52
SMILESONC(=O)C[C@@H](CCCC1CCCCC1)c1nc(CN2CCCS2(=O)=O)no1