Reaction Details
TargetBone morphogenetic protein 1
LigandBDBM50216790
Substrate/Competitorn/a
Meas. Tech.ChEMBL_440136 (CHEMBL890447)
IC50 10±n/a nM
Citation Fish, PVAllan, GABailey, SBlagg, JButt, RCollis, MGGreiling, DJames, KKendall, JMcElroy, AMcCleverty, DReed, CWebster, RWhitlock, GA Potent and selective nonpeptidic inhibitors of procollagen C-proteinase. J Med Chem50:3442-56 (2007) 
 
Bone morphogenetic protein 1
Name:Bone morphogenetic protein 1
Type:PROTEIN
Mol. Mass.:111254.03
Organism:Homo sapiens (Human)
Description:ChEMBL_518962
Residue:986
BDBM50216790
NameBDBM50216790
Synonyms:(3R)-6-cyclohexyl-3-[3-(2,4-dioxo-1,2,3,4-tetrahydro-5-pyrimidinyl)-1,2,4-oxadiazol-5-yl]-N-hydroxyhexanamide | CHEMBL226852
TypeSmall organic molecule
Emp. Form.C18H25N5O5
Mol. Mass.391.4216
SMILESONC(=O)C[C@@H](CCCC1CCCCC1)c1nc(no1)-c1c[nH]c(=O)[nH]c1=O