Reaction Details
TargetBone morphogenetic protein 1
LigandBDBM50216834
Substrate/Competitorn/a
Meas. Tech.ChEMBL_440136 (CHEMBL890447)
IC50 17±n/a nM
Citation Fish, PVAllan, GABailey, SBlagg, JButt, RCollis, MGGreiling, DJames, KKendall, JMcElroy, AMcCleverty, DReed, CWebster, RWhitlock, GA Potent and selective nonpeptidic inhibitors of procollagen C-proteinase. J Med Chem50:3442-56 (2007) 
 
Bone morphogenetic protein 1
Name:Bone morphogenetic protein 1
Type:PROTEIN
Mol. Mass.:111254.03
Organism:Homo sapiens (Human)
Description:ChEMBL_518962
Residue:986
BDBM50216834
NameBDBM50216834
Synonyms:2-(5-{(1R)-4-cyclohexyl-1-[2-(hydroxyamino)-2-oxoethyl]butyl}-1,2,4-oxadiazol-3-yl)isonicotinamide | CHEMBL375964
TypeSmall organic molecule
Emp. Form.C20H27N5O4
Mol. Mass.401.4595
SMILESNC(=O)c1ccnc(c1)-c1noc(n1)[C@H](CCCC1CCCCC1)CC(=O)NO