Reaction Details
Target72 kDa type IV collagenase
LigandBDBM50097259
Substrate/Competitorn/a
Meas. Tech.ChEMBL_440138 (CHEMBL890449)
IC50 1000±n/a nM
Citation Fish, PVAllan, GABailey, SBlagg, JButt, RCollis, MGGreiling, DJames, KKendall, JMcElroy, AMcCleverty, DReed, CWebster, RWhitlock, GA Potent and selective nonpeptidic inhibitors of procollagen C-proteinase. J Med Chem50:3442-56 (2007) 
 
72 kDa type IV collagenase
Name:72 kDa type IV collagenase
Type:Enzyme
Mol. Mass.:73870.36
Organism:Homo sapiens (Human)
Description: P08253
Residue:660
BDBM50097259
NameBDBM50097259
Synonyms:(R)-2-(3-Cyclohexyl-propyl)-N*1*-[(S)-2,2-dimethyl-1-((R)-1-phenyl-ethylcarbamoyl)-propyl]-N*4*-hydroxy-succinamide (R)-2-(3-cyclohexylpropyl)-N1-((S)-3,3-dimethyl-1-oxo-1-((R)-1-phenylethylamino)butan-2-yl)-N4-hydroxysuccinamide | CHEMBL154040
TypeSmall organic molecule
Emp. Form.C27H43N3O4
Mol. Mass.473.648
SMILESC[C@@H](NC(=O)[C@@H](NC(=O)[C@H](CCCC1CCCCC1)CC(=O)NO)C(C)(C)C)c1ccccc1