Reaction Details
Target72 kDa type IV collagenase
LigandBDBM50216838
Substrate/Competitorn/a
Meas. Tech.ChEMBL_440138 (CHEMBL890449)
IC50>100000±n/a nM
Citation Fish, PVAllan, GABailey, SBlagg, JButt, RCollis, MGGreiling, DJames, KKendall, JMcElroy, AMcCleverty, DReed, CWebster, RWhitlock, GA Potent and selective nonpeptidic inhibitors of procollagen C-proteinase. J Med Chem50:3442-56 (2007) 
 
72 kDa type IV collagenase
Name:72 kDa type IV collagenase
Type:Enzyme
Mol. Mass.:73870.36
Organism:Homo sapiens (Human)
Description: P08253
Residue:660
BDBM50216838
NameBDBM50216838
Synonyms:(3R)-6-cyclohexyl-N-hydroxy-3-{3-[1-(methylsulfonyl)-4-piperidinyl]-1,2,4-oxadiazol-5-yl}hexanamide | CHEMBL226840
TypeSmall organic molecule
Emp. Form.C21H37N5O5S
Mol. Mass.471.614
SMILESCS(=O)(=O)N1CCC(CC1)NCc1noc(n1)[C@H](CCCC1CCCCC1)CC(=O)NO