Reaction Details
TargetProtein kinase C delta type
LigandBDBM50057512
Substrate/Competitorn/a
Meas. Tech.ChEMBL_440177 (CHEMBL890491)
Ki 6.2±n/a nM
Citation Choi, YPu, YPeach, MLKang, JHLewin, NESigano, DMGarfield, SHBlumberg, PMMarquez, VE Conformationally constrained analogues of diacylglycerol (DAG). 28. DAG-dioxolanones reveal a new additional interaction site in the C1b domain of PKC delta. J Med Chem50:3465-81 (2007) 
 
Protein kinase C delta type
Name:Protein kinase C delta type
Type:PROTEIN
Mol. Mass.:77554.99
Organism:Mus musculus
Description:ChEMBL_1351519
Residue:674
BDBM50057512
NameBDBM50057512
Synonyms:(1aR,1bS,4aR,7aS,7bS,8R,9R,9aS)-4a,7b-dihydroxy-3-(hydroxymethyl)-1,1,6,8-tetramethyl-5-oxo-1,1a,1b,4,4a,5,7a,7b,8,9-decahydro-9aH-cyclopropa[3,4]benzo[1,2-e]azulene-9,9a-diyl dibutanoate PDBu phorbol 12,13-dibutyrate
TypeSmall organic molecule
Emp. Form.C28H40O8
Mol. Mass.504.6124
SMILESCCCC(=O)O[C@@H]1[C@@H](C)[C@]2(O)[C@@H]3C=C(C)C(=O)[C@@]3(O)CC(CO)=C[C@H]2[C@@H]2C(C)(C)[C@]12OC(=O)CCC