Reaction Details
TargetProtein kinase C alpha type
LigandBDBM50107112
Substrate/Competitorn/a
Meas. Tech.ChEMBL_440175 (CHEMBL890489)
Ki 2.9±n/a nM
Citation Choi, YPu, YPeach, MLKang, JHLewin, NESigano, DMGarfield, SHBlumberg, PMMarquez, VE Conformationally constrained analogues of diacylglycerol (DAG). 28. DAG-dioxolanones reveal a new additional interaction site in the C1b domain of PKC delta. J Med Chem50:3465-81 (2007) 
 
Protein kinase C alpha type
Name:Protein kinase C alpha type
Type:Enzyme Catalytic Domain
Mol. Mass.:76858.67
Organism:MOUSE
Description:Protein kinase C 0 MOUSE::P20444
Residue:672
BDBM50107112
NameBDBM50107112
Synonyms:(Z) 2,2-Dimethyl-propionic acid 2-hydroxymethyl-4-(3-isobutyl-5-methyl-hexylidene)-5-oxo-tetrahydro-furan-2-ylmethyl ester (Z)-2-(2-(hydroxymethyl)-4-(3-isobutyl-5-methylhexylidene)-5-oxo-tetrahydrofuran-2-yl)ethyl pivalate 2,2-Dimethyl-propionic acid 2-hydroxymethyl-4-[3-isobutyl-5-methyl-hex-(Z)-ylidene]-5-oxo-tetrahydro-furan-2-ylmethyl ester DAG-lactone (HK-434)
TypeSmall organic molecule
Emp. Form.C22H38O5
Mol. Mass.382.5341
SMILESCC(C)CC(C\C=C1\CC(CO)(COC(=O)C(C)(C)C)OC1=O)CC(C)C