Reaction Details
Target11-beta-hydroxysteroid dehydrogenase 1
LigandBDBM50216921
Substrate/Competitorn/a
Meas. Tech.ChEMBL_448530 (CHEMBL897679)
Ki 4±n/a nM
Citation Sutin, LAndersson, SBergquist, LCastro, VMDanielsson, EJames, SHenriksson, MJohansson, LKaiser, CFlyrén, KWilliams, M Oxazolones as potent inhibitors of 11beta-hydroxysteroid dehydrogenase type 1. Bioorg Med Chem Lett17:4837-40 (2007) 
 
11-beta-hydroxysteroid dehydrogenase 1
Name:11-beta-hydroxysteroid dehydrogenase 1
Type:Enzyme
Mol. Mass.:32409.16
Organism:Homo sapiens (Human)
Description:P28845
Residue:292
BDBM50216921
NameBDBM50216921
Synonyms:2-(1-adamantylamino)-1-oxa-3-azaspiro[4.4]non-2-en-4-one | CHEMBL235016
TypeSmall organic molecule
Emp. Form.C17H24N2O2
Mol. Mass.288.3847
SMILESO=C1N=C(NC23CC4CC(CC(C4)C2)C3)OC11CCCC1