Reaction Details
TargetDelta-type opioid receptor
LigandBDBM50216980
Substrate/Competitorn/a
Meas. Tech.ChEMBL_448540 (CHEMBL897689)
EC50 88±n/a nM
Citation Wu, HSmith, TAHuang, HWang, JBDeschamps, JRCoop, A Functionalization of the 6,14-bridge of the orvinols. Part 3: preparation and pharmacological evaluation of 18- and 19-hydroxyl substituted orvinols. Bioorg Med Chem Lett17:4829-31 (2007) 
 
Delta-type opioid receptor
Name:Delta-type opioid receptor
Type:G Protein-Coupled Receptor (GPCR)
Mol. Mass.:40382.98
Organism:Homo sapiens (Human)
Description:Competition binding assays were carried out using membrane preparations from transfected HN9.10 cells that constitutively expressed the delta opioid receptor.
Residue:372
BDBM50216980
NameBDBM50216980
Synonyms:CHEMBL401245 UMB94
TypeSmall organic molecule
Emp. Form.C22H29NO5
Mol. Mass.387.4694
SMILESCO[C@]12[C@@H]3Oc4c5c(C[C@H]6N(C)CC[C@@]35[C@]6(CC1O)C[C@@H]2[C@@H](C)O)ccc4O