Reaction Details
TargetGlutamate receptor ionotropic, NMDA 1
LigandBDBM50217031
Substrate/Competitorn/a
Meas. Tech.ChEMBL_440414 (CHEMBL890728)
IC50 315000±n/a nM
Citation Sibille, PLopez, SBrabet, IValenti, OOueslati, NGaven, FGoudet, CBertrand, HONeyton, JMarino, MJAmalric, MPin, JPAcher, FC Synthesis and biological evaluation of 1-amino-2-phosphonomethylcyclopropanecarboxylic acids, new group III metabotropic glutamate receptor agonists. J Med Chem50:3585-95 (2007) 
 
Glutamate receptor ionotropic, NMDA 1
Name:Glutamate receptor ionotropic, NMDA 1
Type:Enzyme Catalytic Domain
Mol. Mass.:105533.40
Organism:RAT
Description:P35439
Residue:938
BDBM50217031
NameBDBM50217031
Synonyms:(1S,2R)-1-amino-2-phosphonomethylcyclopropane-carboxylic acid | CHEMBL229697
TypeSmall organic molecule
Emp. Form.C5H10NO5P
Mol. Mass.195.1104
SMILESN[C@]1(C[C@H]1CP(O)(O)=O)C(O)=O