Reaction Details
TargetCannabinoid receptor 1
LigandBDBM50217077
Substrate/Competitorn/a
Meas. Tech.ChEMBL_440456 (CHEMBL890771)
Ki 2600±n/a nM
Citation Minutolo, FCascio, MGCarboni, IBisogno, TProta, GBertini, SDigiacomo, MBifulco, MDi Marzo, VMacchia, M Metabolically labile cannabinoid esters: a 'soft drug' approach for the development of cannabinoid-based therapeutic drugs. Bioorg Med Chem Lett17:4878-81 (2007) 
 
Cannabinoid receptor 1
Name:Cannabinoid receptor 1
Type:G Protein-Coupled Receptor (GPCR)
Mol. Mass.:52868.96
Organism:Homo sapiens (Human)
Description:P21554
Residue:472
BDBM50217077
NameBDBM50217077
Synonyms:2,6-dihydroxy-3',5'-dimethyl-biphenyl-4-carboxylic acid butyl ester | CHEMBL228372
TypeSmall organic molecule
Emp. Form.C19H22O4
Mol. Mass.314.3756
SMILESCCCCOC(=O)c1cc(O)c(c(O)c1)-c1cc(C)cc(C)c1