Reaction Details
TargetCannabinoid receptor 1
LigandBDBM50217078
Substrate/Competitorn/a
Meas. Tech.ChEMBL_440456 (CHEMBL890771)
Ki 1400±n/a nM
Citation Minutolo, FCascio, MGCarboni, IBisogno, TProta, GBertini, SDigiacomo, MBifulco, MDi Marzo, VMacchia, M Metabolically labile cannabinoid esters: a 'soft drug' approach for the development of cannabinoid-based therapeutic drugs. Bioorg Med Chem Lett17:4878-81 (2007) 
 
Cannabinoid receptor 1
Name:Cannabinoid receptor 1
Type:G Protein-Coupled Receptor (GPCR)
Mol. Mass.:52868.96
Organism:Homo sapiens (Human)
Description:P21554
Residue:472
BDBM50217078
NameBDBM50217078
Synonyms:2-hydroxy-6-methoxy-3',5'-dimethyl-biphenyl-4-carboxylic acid pentyl ester | CHEMBL436801
TypeSmall organic molecule
Emp. Form.C21H26O4
Mol. Mass.342.4287
SMILESCCCCCOC(=O)c1cc(O)c(c(OC)c1)-c1cc(C)cc(C)c1