Reaction Details
TargetMelanocyte-stimulating hormone receptor
LigandBDBM50217647
Substrate/Competitorn/a
Meas. Tech.ChEMBL_448689 (CHEMBL896689)
Ki 1300±n/a nM
Citation Mutulis, FKreicberga, JYahorava, SMutule, IBorisova-Jan, LYahorau, AMuceniece, RAzena, SVeiksina, SPetrovska, RWikberg, JE Design and synthesis of a library of tertiary amides: evaluation as mimetics of the melanocortins' active core. Bioorg Med Chem15:5787-810 (2007) 
 
Melanocyte-stimulating hormone receptor
Name:Melanocyte-stimulating hormone receptor
Type:PROTEIN
Mol. Mass.:35238.60
Organism:Mus musculus
Description:ChEMBL_1498846
Residue:315
BDBM50217647
NameBDBM50217647
Synonyms:CHEMBL238154 | N-(4-((4-amino-3-methylcyclohexyl)methyl)-2-methylcyclohexyl)-N-benzyl-4-(1H-indol-3-yl)butanamide
TypeSmall organic molecule
Emp. Form.C34H47N3O
Mol. Mass.513.7565
SMILESCC1CC(CC2CCC(C(C)C2)N(Cc2ccccc2)C(=O)CCCc2c[nH]c3ccccc23)CCC1N