Reaction Details
TargetMelanocyte-stimulating hormone receptor
LigandBDBM50217650
Substrate/Competitorn/a
Meas. Tech.ChEMBL_448689 (CHEMBL896689)
Ki 1400±n/a nM
Citation Mutulis, FKreicberga, JYahorava, SMutule, IBorisova-Jan, LYahorau, AMuceniece, RAzena, SVeiksina, SPetrovska, RWikberg, JE Design and synthesis of a library of tertiary amides: evaluation as mimetics of the melanocortins' active core. Bioorg Med Chem15:5787-810 (2007) 
 
Melanocyte-stimulating hormone receptor
Name:Melanocyte-stimulating hormone receptor
Type:PROTEIN
Mol. Mass.:35238.60
Organism:Mus musculus
Description:ChEMBL_1498846
Residue:315
BDBM50217650
NameBDBM50217650
Synonyms:CHEMBL237919 | N-(4-((4-aminocyclohexyl)methyl)cyclohexyl)-N-benzyl-4-(1H-indol-3-yl)butanamide
TypeSmall organic molecule
Emp. Form.C32H43N3O
Mol. Mass.485.7033
SMILESNC1CCC(CC2CCC(CC2)N(Cc2ccccc2)C(=O)CCCc2c[nH]c3ccccc23)CC1