Reaction Details
TargetMelanocyte-stimulating hormone receptor
LigandBDBM50217638
Substrate/Competitorn/a
Meas. Tech.ChEMBL_448689 (CHEMBL896689)
Ki 1200±n/a nM
Citation Mutulis, FKreicberga, JYahorava, SMutule, IBorisova-Jan, LYahorau, AMuceniece, RAzena, SVeiksina, SPetrovska, RWikberg, JE Design and synthesis of a library of tertiary amides: evaluation as mimetics of the melanocortins' active core. Bioorg Med Chem15:5787-810 (2007) 
 
Melanocyte-stimulating hormone receptor
Name:Melanocyte-stimulating hormone receptor
Type:PROTEIN
Mol. Mass.:35238.60
Organism:Mus musculus
Description:ChEMBL_1498846
Residue:315
BDBM50217638
NameBDBM50217638
Synonyms:CHEMBL391944 | N-{4-[(4-aminocyclohexyl)methyl]cyclohexyl}-4-(1H-indol-3-yl)-N-[(2-methylphenyl)methyl]butanamide
TypeSmall organic molecule
Emp. Form.C33H45N3O
Mol. Mass.499.7299
SMILESCc1ccccc1CN(C1CCC(CC2CCC(N)CC2)CC1)C(=O)CCCc1c[nH]c2ccccc12