Reaction Details
TargetMelanocortin receptor 5
LigandBDBM50217783
Substrate/Competitorn/a
Meas. Tech.ChEMBL_448695 (CHEMBL897841)
Ki 930±n/a nM
Citation Mutulis, FKreicberga, JYahorava, SMutule, IBorisova-Jan, LYahorau, AMuceniece, RAzena, SVeiksina, SPetrovska, RWikberg, JE Design and synthesis of a library of tertiary amides: evaluation as mimetics of the melanocortins' active core. Bioorg Med Chem15:5787-810 (2007) 
 
Melanocortin receptor 5
Name:Melanocortin receptor 5
Type:Enzyme
Mol. Mass.:36612.92
Organism:Homo sapiens (Human)
Description:P33032
Residue:325
BDBM50217783
NameBDBM50217783
Synonyms:(E)-N-(3-aminopropyl)-N-(2-methyl-3-phenylallyl)-1H-indole-3-carboxamide | CHEMBL391823
TypeSmall organic molecule
Emp. Form.C22H25N3O
Mol. Mass.347.4534
SMILESC\C(CN(CCCN)C(=O)c1c[nH]c2ccccc12)=C/c1ccccc1