Reaction Details
TargetCannabinoid receptor 2
LigandBDBM50218270
Substrate/Competitorn/a
Meas. Tech.ChEMBL_448728 (CHEMBL897874)
IC50 16±n/a nM
Citation Ohta, HIshizaka, TYoshinaga, MMorita, ATomishima, YToda, YSaito, S Sulfonamide derivatives as new potent and selective CB2 cannabinoid receptor agonists. Bioorg Med Chem Lett17:5133-5 (2007) 
 
Cannabinoid receptor 2
Name:Cannabinoid receptor 2
Type:G Protein-Coupled Receptor (GPCR)
Mol. Mass.:39690.94
Organism:Homo sapiens (Human)
Description:P34972
Residue:360
BDBM50218270
NameBDBM50218270
Synonyms:(Z)-N-(5-tert-butyl-3-(cyclopropylmethyl)-4-methylthiazol-2(3H)-ylidene)naphthalene-1-sulfonamide | CHEMBL236374
TypeSmall organic molecule
Emp. Form.C22H26N2O2S2
Mol. Mass.414.584
SMILESCc1c(s\c(=N/S(=O)(=O)c2cccc3ccccc23)n1CC1CC1)C(C)(C)C