Reaction Details
TargetAurora kinase A
LigandBDBM50191449
Substrate/Competitorn/a
Meas. Tech.ChEMBL_445189 (CHEMBL894337)
IC50>100000±n/a nM
Citation Myrianthopoulos, VMagiatis, PFerandin, YSkaltsounis, ALMeijer, LMikros, E An integrated computational approach to the phenomenon of potent and selective inhibition of aurora kinases B and C by a series of 7-substituted indirubins. J Med Chem50:4027-37 (2007) 
 
Aurora kinase A
Name:Aurora kinase A
Type:Serine/threonine-protein kinase
Mol. Mass.:45830.98
Organism:Homo sapiens (Human)
Description:O14965
Residue:403
BDBM50191449
NameBDBM50191449
Synonyms:(2'Z)-7-iodoindirubin | CHEMBL379160
TypeSmall organic molecule
Emp. Form.C16H9IN2O2
Mol. Mass.388.1593
SMILESOc1[nH]c2c(I)cccc2c1C1=Nc2ccccc2C1=O