Reaction Details
TargetAurora kinase C
LigandBDBM50191440
Substrate/Competitorn/a
Meas. Tech.ChEMBL_445191 (CHEMBL894339)
IC50>100000±n/a nM
Citation Myrianthopoulos, VMagiatis, PFerandin, YSkaltsounis, ALMeijer, LMikros, E An integrated computational approach to the phenomenon of potent and selective inhibition of aurora kinases B and C by a series of 7-substituted indirubins. J Med Chem50:4027-37 (2007) 
 
Aurora kinase C
Name:Aurora kinase C
Type:Enzyme
Mol. Mass.:35602.43
Organism:Homo sapiens (Human)
Description:Amino acid residues 1-309 were expressed as His-tagged fusion protein using baculovirus expression system.
Residue:309
BDBM50191440
NameBDBM50191440
Synonyms:(2'Z)-7-bromoindirubin | CHEMBL214173
TypeSmall organic molecule
Emp. Form.C16H9BrN2O2
Mol. Mass.341.159
SMILESOc1[nH]c2c(Br)cccc2c1C1=Nc2ccccc2C1=O