Reaction Details
TargetAurora kinase C
LigandBDBM50191418
Substrate/Competitorn/a
Meas. Tech.ChEMBL_445191 (CHEMBL894339)
IC50 900±n/a nM
Citation Myrianthopoulos, VMagiatis, PFerandin, YSkaltsounis, ALMeijer, LMikros, E An integrated computational approach to the phenomenon of potent and selective inhibition of aurora kinases B and C by a series of 7-substituted indirubins. J Med Chem50:4027-37 (2007) 
 
Aurora kinase C
Name:Aurora kinase C
Type:Enzyme
Mol. Mass.:35602.43
Organism:Homo sapiens (Human)
Description:Amino acid residues 1-309 were expressed as His-tagged fusion protein using baculovirus expression system.
Residue:309
BDBM50191418
NameBDBM50191418
Synonyms:(2'Z,3'E)-7-chloroindirubin-3'-oxime | CHEMBL213650
TypeSmall organic molecule
Emp. Form.C16H10ClN3O2
Mol. Mass.311.723
SMILESOc1[nH]c2c(Cl)cccc2c1-c1[nH]c2ccccc2c1N=O