Reaction Details
TargetAurora kinase A
LigandBDBM50191448
Substrate/Competitorn/a
Meas. Tech.ChEMBL_445189 (CHEMBL894337)
IC50 2000±n/a nM
Citation Myrianthopoulos, VMagiatis, PFerandin, YSkaltsounis, ALMeijer, LMikros, E An integrated computational approach to the phenomenon of potent and selective inhibition of aurora kinases B and C by a series of 7-substituted indirubins. J Med Chem50:4027-37 (2007) 
 
Aurora kinase A
Name:Aurora kinase A
Type:Serine/threonine-protein kinase
Mol. Mass.:45830.98
Organism:Homo sapiens (Human)
Description:O14965
Residue:403
BDBM50191448
NameBDBM50191448
Synonyms:(2'Z,3'E)-7-fluoroindirubin-3'-oxime | CHEMBL212174
TypeSmall organic molecule
Emp. Form.C16H10FN3O2
Mol. Mass.295.2679
SMILESOc1[nH]c2c(F)cccc2c1-c1[nH]c2ccccc2c1N=O