Reaction Details
TargetAurora kinase C
LigandBDBM50024792
Substrate/Competitorn/a
Meas. Tech.ChEMBL_445191 (CHEMBL894339)
IC50 700±n/a nM
Citation Myrianthopoulos, VMagiatis, PFerandin, YSkaltsounis, ALMeijer, LMikros, E An integrated computational approach to the phenomenon of potent and selective inhibition of aurora kinases B and C by a series of 7-substituted indirubins. J Med Chem50:4027-37 (2007) 
 
Aurora kinase C
Name:Aurora kinase C
Type:Enzyme
Mol. Mass.:35602.43
Organism:Homo sapiens (Human)
Description:Amino acid residues 1-309 were expressed as His-tagged fusion protein using baculovirus expression system.
Residue:309
BDBM50024792
NameBDBM50024792
Synonyms:CHEMBL209849 | Indirubin-3-Acetoxime
TypeSmall organic molecule
Emp. Form.C18H13N3O3
Mol. Mass.319.3141
SMILESCC(=O)O\N=C1/C(=Nc2ccccc12)c1c(O)[nH]c2ccccc12