Reaction Details
TargetAurora kinase B
LigandBDBM50191398
Substrate/Competitorn/a
Meas. Tech.ChEMBL_445190 (CHEMBL894338)
IC50 10000±n/a nM
Citation Myrianthopoulos, VMagiatis, PFerandin, YSkaltsounis, ALMeijer, LMikros, E An integrated computational approach to the phenomenon of potent and selective inhibition of aurora kinases B and C by a series of 7-substituted indirubins. J Med Chem50:4027-37 (2007) 
 
Aurora kinase B
Name:Aurora kinase B
Type:Protein
Mol. Mass.:39327.72
Organism:Homo sapiens (Human)
Description:Q96GD4
Residue:344
BDBM50191398
NameBDBM50191398
Synonyms:(2'Z,3'E)-7-iodoindirubin-3'-oxime | CHEMBL209648
TypeSmall organic molecule
Emp. Form.C16H10IN3O2
Mol. Mass.403.174
SMILESOc1[nH]c2c(I)cccc2c1-c1[nH]c2ccccc2c1N=O