Reaction Details
TargetAurora kinase C
LigandBDBM50132003
Substrate/Competitorn/a
Meas. Tech.ChEMBL_445191 (CHEMBL894339)
IC50 300±n/a nM
Citation Myrianthopoulos, VMagiatis, PFerandin, YSkaltsounis, ALMeijer, LMikros, E An integrated computational approach to the phenomenon of potent and selective inhibition of aurora kinases B and C by a series of 7-substituted indirubins. J Med Chem50:4027-37 (2007) 
 
Aurora kinase C
Name:Aurora kinase C
Type:Enzyme
Mol. Mass.:35602.43
Organism:Homo sapiens (Human)
Description:Amino acid residues 1-309 were expressed as His-tagged fusion protein using baculovirus expression system.
Residue:309
BDBM50132003
NameBDBM50132003
Synonyms:(Z)-1H,1''H-[2,3'']Biindolylidene-3,2''-dione 3-oxime 1H,1''H-[2,3'']Biindolylidene-3,2''-dione 3-oxime 3-(3-(hydroxyimino)indolin-2-ylidene)indolin-2-one | CHEMBL126077
TypeSmall organic molecule
Emp. Form.C16H11N3O2
Mol. Mass.277.2774
SMILESOc1[nH]c2ccccc2c1-c1[nH]c2ccccc2c1N=O