Reaction Details
TargetAurora kinase B
LigandBDBM50218902
Substrate/Competitorn/a
Meas. Tech.ChEMBL_445190 (CHEMBL894338)
IC50>100000±n/a nM
Citation Myrianthopoulos, VMagiatis, PFerandin, YSkaltsounis, ALMeijer, LMikros, E An integrated computational approach to the phenomenon of potent and selective inhibition of aurora kinases B and C by a series of 7-substituted indirubins. J Med Chem50:4027-37 (2007) 
 
Aurora kinase B
Name:Aurora kinase B
Type:Protein
Mol. Mass.:39327.72
Organism:Homo sapiens (Human)
Description:Q96GD4
Residue:344
BDBM50218902
NameBDBM50218902
Synonyms:7-bromoindirubin-3-methoxime | CHEMBL243556
TypeSmall organic molecule
Emp. Form.C17H12BrN3O2
Mol. Mass.370.2
SMILESCO\N=C1/C(/Nc2ccccc/12)=C1/C(=O)Nc2c1cccc2Br