Reaction Details
TargetAurora kinase B
LigandBDBM50132003
Substrate/Competitorn/a
Meas. Tech.ChEMBL_445190 (CHEMBL894338)
IC50 2300±n/a nM
Citation Myrianthopoulos, VMagiatis, PFerandin, YSkaltsounis, ALMeijer, LMikros, E An integrated computational approach to the phenomenon of potent and selective inhibition of aurora kinases B and C by a series of 7-substituted indirubins. J Med Chem50:4027-37 (2007) 
 
Aurora kinase B
Name:Aurora kinase B
Type:Protein
Mol. Mass.:39327.72
Organism:Homo sapiens (Human)
Description:Q96GD4
Residue:344
BDBM50132003
NameBDBM50132003
Synonyms:(Z)-1H,1''H-[2,3'']Biindolylidene-3,2''-dione 3-oxime 1H,1''H-[2,3'']Biindolylidene-3,2''-dione 3-oxime 3-(3-(hydroxyimino)indolin-2-ylidene)indolin-2-one | CHEMBL126077
TypeSmall organic molecule
Emp. Form.C16H11N3O2
Mol. Mass.277.2774
SMILESOc1[nH]c2ccccc2c1-c1[nH]c2ccccc2c1N=O