Reaction Details
TargetAurora kinase A
LigandBDBM50218903
Substrate/Competitorn/a
Meas. Tech.ChEMBL_445189 (CHEMBL894337)
IC50>100000±n/a nM
Citation Myrianthopoulos, VMagiatis, PFerandin, YSkaltsounis, ALMeijer, LMikros, E An integrated computational approach to the phenomenon of potent and selective inhibition of aurora kinases B and C by a series of 7-substituted indirubins. J Med Chem50:4027-37 (2007) 
 
Aurora kinase A
Name:Aurora kinase A
Type:Serine/threonine-protein kinase
Mol. Mass.:45830.98
Organism:Homo sapiens (Human)
Description:O14965
Residue:403
BDBM50218903
NameBDBM50218903
Synonyms:7-iodoindirubin-3-methoxime | CHEMBL244191
TypeSmall organic molecule
Emp. Form.C17H12IN3O2
Mol. Mass.417.2006
SMILESCO\N=C1/C(/Nc2ccccc/12)=C1/C(=O)Nc2c1cccc2I