Reaction Details
TargetAurora kinase C
LigandBDBM50218886
Substrate/Competitorn/a
Meas. Tech.ChEMBL_445191 (CHEMBL894339)
IC50>100000±n/a nM
Citation Myrianthopoulos, VMagiatis, PFerandin, YSkaltsounis, ALMeijer, LMikros, E An integrated computational approach to the phenomenon of potent and selective inhibition of aurora kinases B and C by a series of 7-substituted indirubins. J Med Chem50:4027-37 (2007) 
 
Aurora kinase C
Name:Aurora kinase C
Type:Enzyme
Mol. Mass.:35602.43
Organism:Homo sapiens (Human)
Description:Amino acid residues 1-309 were expressed as His-tagged fusion protein using baculovirus expression system.
Residue:309
BDBM50218886
NameBDBM50218886
Synonyms:7-chloroindirubin-3-acetoxime | CHEMBL397719
TypeSmall organic molecule
Emp. Form.C18H12ClN3O3
Mol. Mass.353.759
SMILESCC(=O)ON=C1C(Nc2ccccc12)=C1C(=O)Nc2c1cccc2Cl