Reaction Details
TargetAdenosine receptor A2a
LigandBDBM21173
Substrate/Competitorn/a
Meas. Tech.ChEMBL_445196 (CHEMBL894344)
Ki 260±n/a nM
Citation Colotta, VCatarzi, DVarano, FCapelli, FLenzi, OFilacchioni, GMartini, CTrincavelli, LCiampi, OPugliese, AMPedata, FSchiesaro, AMorizzo, EMoro, S New 2-arylpyrazolo[3,4-c]quinoline derivatives as potent and selective human A3 adenosine receptor antagonists. Synthesis, pharmacological evaluation, and ligand-receptor modeling studies. J Med Chem50:4061-74 (2007) 
 
Adenosine receptor A2a
Name:Adenosine receptor A2a
Type:G Protein-Coupled Receptor (GPCR)
Mol. Mass.:44716.46
Organism:Homo sapiens (Human)
Description:P29274
Residue:412
BDBM21173
NameBDBM21173
Synonyms:1,3-dipropyl-8-cyclopentylxanthine CHEMBL183 PD116948 | [3H]DPCPX
Typeradiolabeled ligand
Emp. Form.C16H24N4O2
Mol. Mass.304.3874
SMILESCCCn1c2nc([nH]c2c(=O)n(CCC)c1=O)C1CCCC1