Reaction Details
Target5-hydroxytryptamine receptor 1A
LigandBDBM50071959
Substrate/Competitorn/a
Meas. Tech.ChEMBL_445365 (CHEMBL895655)
Ki 2040±n/a nM
Citation Grundt, PPrevatt, KMCao, JTaylor, MFloresca, CZChoi, JKJenkins, BGLuedtke, RRNewman, AH Heterocyclic analogues of N-(4-(4-(2,3-dichlorophenyl)piperazin-1-yl)butyl)arylcarboxamides with functionalized linking chains as novel dopamine D3 receptor ligands: potential substance abuse therapeutic agents. J Med Chem50:4135-46 (2007) 
 
5-hydroxytryptamine receptor 1A
Name:5-hydroxytryptamine receptor 1A
Type:n/a
Mol. Mass.:46122.49
Organism:Homo sapiens (Human)
Description:n/a
Residue:422
BDBM50071959
NameBDBM50071959
Synonyms:9H-Fluorene-2-carboxylic acid {4-[4-(2,3-dichloro-phenyl)-piperazin-1-yl]-butyl}-amide N-(4-(4-(2,3-dichlorophenyl)piperazin-1-yl)butyl)-9H-fluorene-2-carboxamide
TypeSmall organic molecule
Emp. Form.C28H29Cl2N3O
Mol. Mass.494.455
SMILESClc1cccc(N2CCN(CCCCNC(=O)c3ccc-4c(Cc5ccccc-45)c3)CC2)c1Cl