Reaction Details
TargetD(3) dopamine receptor
LigandBDBM50219140
Substrate/Competitorn/a
Meas. Tech.ChEMBL_445433 (CHEMBL895725)
Ki 3136±n/a nM
Citation Enzensperger, CMüller, FKSchmalwasser, BWiecha, PTraber, HLehmann, J Dopamine/serotonin receptor ligands. 16.(1) Expanding dibenz[d,g]azecines to 11- and 12-membered homologues. Interaction with dopamine D(1)-D(5) receptors. J Med Chem50:4528-33 (2007) 
 
D(3) dopamine receptor
Name:D(3) dopamine receptor
Type:n/a
Mol. Mass.:44243.43
Organism:Homo sapiens (Human)
Description:n/a
Residue:400
BDBM50219140
NameBDBM50219140
Synonyms:12-methoxy-7-methyl-6,7,8,9,10,15-hexahydro-5H-dibenzo[d,g]azacycloundecene CHEMBL389357
TypeSmall organic molecule
Emp. Form.C20H25NO
Mol. Mass.295.4186
SMILESCOc1ccc2Cc3ccccc3CCN(C)CCCc2c1