Reaction Details
TargetAdenosine receptor A1
LigandBDBM50292320
Substrate/Competitorn/a
Meas. Tech.ChEMBL_457192 (CHEMBL940793)
Ki 7±n/a nM
Citation Gregg, ABottle, SEDevine, SMFigler, HLinden, JWhite, PPouton, CWUrmaliya, VScammells, PJ Dual acting antioxidant A1 adenosine receptor agonists. Bioorg Med Chem Lett17:5437-41 (2007) 
 
Adenosine receptor A1
Name:Adenosine receptor A1
Type:G Protein-Coupled Receptor (GPCR)
Mol. Mass.:36520.92
Organism:Homo sapiens (Human)
Description:P30542
Residue:326
BDBM50292320
NameBDBM50292320
Synonyms:CHEMBL400746 N6-[4-[2-[1,1,3,3-tetramethylisoindol-2-yloxyl-5amido]ethyl]phenyl]adenosine | VCP-102
TypeSmall organic molecule
Emp. Form.C31H36N7O6
Mol. Mass.602.6608
SMILESCC1(C)N([O])C(C)(C)c2cc(ccc12)C(=O)NCCc1ccc(Nc2ncnc3n(cnc23)[C@@H]2O[C@H](CO)[C@@H](O)[C@H]2O)cc1