Reaction Details
TargetSubstance-P receptor
LigandBDBM50220118
Substrate/Competitorn/a
Meas. Tech.ChEMBL_449085 (CHEMBL899345)
IC50 0.07±n/a nM
Citation Young, JREid, RTurner, CDeVita, RJKurtz, MMTsao, KLChicchi, GGWheeldon, ACarlson, EMills, SG Pyrrolidine-carboxamides and oxadiazoles as potent hNK1 antagonists. Bioorg Med Chem Lett17:5310-5 (2007) 
 
Substance-P receptor
Name:Substance-P receptor
Type:G Protein-Coupled Receptor (GPCR)
Mol. Mass.:46254.43
Organism:Homo sapiens (Human)
Description:P25103
Residue:407
BDBM50220118
NameBDBM50220118
Synonyms:1-(4-((3R,4S)-3-(3-(2-(3,5-bis(trifluoromethyl)phenyl)propan-2-yl)-1,2,4-oxadiazol-5-yl)-4-(4-fluoro-2-methylphenyl)pyrrolidine-1-carbonyl)piperidin-1-yl)ethanone | CHEMBL392463
TypeSmall organic molecule
Emp. Form.C32H33F7N4O3
Mol. Mass.654.6182
SMILESCC(=O)N1CCC(CC1)C(=O)N1C[C@@H]([C@H](C1)c1ccc(F)cc1C)c1nc(no1)C(C)(C)c1cc(cc(c1)C(F)(F)F)C(F)(F)F