Reaction Details
TargetProstaglandin G/H synthase 2
LigandBDBM11639
Substrate/Competitorn/a
Meas. Tech.ChEMBL_449250 (CHEMBL899512)
IC50 70±n/a nM
Citation Abdellatif, KRDong, YChen, QHChowdhury, MAKnaus, EE Novel (E)-2-(aryl)-3-(4-methanesulfonylphenyl)acrylic ester prodrugs possessing a diazen-1-ium-1,2-diolate moiety: design, synthesis, cyclooxygenase inhibition, and nitric oxide release studies. Bioorg Med Chem15:6796-801 (2007) 
 
Prostaglandin G/H synthase 2
Name:Prostaglandin G/H synthase 2
Type:Protein
Mol. Mass.:68976.98
Organism:Ovis aries (Sheep)
Description:n/a
Residue:603
BDBM11639
NameBDBM11639
Synonyms:4-[5-(4-methylphenyl)-3-(trifluoromethyl)-1H-pyrazol-1-yl]benzene-1-sulfonamide CLX Celecoxib US11478464, Compound Celecoxib US8741944, Comparative Compound cid_2662
TypeSmall organic molecule
Emp. Form.C17H14F3N3O2S
Mol. Mass.381.372
SMILESCc1ccc(cc1)-c1cc(nn1-c1ccc(cc1)S(N)(=O)=O)C(F)(F)F