Reaction Details
TargetHydroxycarboxylic acid receptor 3
LigandBDBM50220842
Substrate/Competitorn/a
Meas. Tech.ChEMBL_449369 (CHEMBL899636)
EC50 11749±n/a nM
Citation Skinner, PJCherrier, MCWebb, PJShin, YJGharbaoui, TLindstrom, AHong, VTamura, SYDang, HTPride, CCChen, RRichman, JGConnolly, DTSemple, G Fluorinated pyrazole acids are agonists of the high affinity niacin receptor GPR109a. Bioorg Med Chem Lett17:5620-3 (2007) 
 
Hydroxycarboxylic acid receptor 3
Name:Hydroxycarboxylic acid receptor 3
Type:Enzyme Catalytic Domain
Mol. Mass.:44498.06
Organism:Homo sapiens (Human)
Description:GPR109B 0 HUMAN::P49019
Residue:387
BDBM50220842
NameBDBM50220842
Synonyms:3-butyl-1H-pyrazole-5-carboxylic acid CHEMBL428730
TypeSmall organic molecule
Emp. Form.C8H12N2O2
Mol. Mass.168.1931
SMILESCCCCc1cc(n[nH]1)C(O)=O