Reaction Details
TargetMelanocortin receptor 4
LigandBDBM50221129
Substrate/Competitorn/a
Meas. Tech.ChEMBL_449484 (CHEMBL899759)
Ki 3.8±n/a nM
Citation Jiang, WTucci, FCTran, JAFleck, BAWen, JMarkison, SMarinkovic, DChen, CWArellano, MHoare, SRJohns, MFoster, ACSaunders, JChen, C Pyrrolidinones as potent functional antagonists of the human melanocortin-4 receptor. Bioorg Med Chem Lett17:5610-3 (2007) 
 
Melanocortin receptor 4
Name:Melanocortin receptor 4
Type:Enzyme
Mol. Mass.:36949.50
Organism:Homo sapiens (Human)
Description:P32245
Residue:332
BDBM50221129
NameBDBM50221129
Synonyms:1-((R)-3-(2,4-dichlorophenyl)-1-(4-(2-((S)-3-methyl-1-(2-(methylamino)ethylamino)butyl)phenyl)piperazin-1-yl)-1-oxopropan-2-yl)pyrrolidin-2-one | CHEMBL393204
TypeSmall organic molecule
Emp. Form.C31H43Cl2N5O2
Mol. Mass.588.611
SMILESCNCCN[C@@H](CC(C)C)c1ccccc1N1CCN(CC1)C(=O)[C@@H](Cc1ccc(Cl)cc1Cl)N1CCCC1=O