Reaction Details
TargetMelanocortin receptor 5
LigandBDBM50221119
Substrate/Competitorn/a
Meas. Tech.ChEMBL_449493 (CHEMBL899761)
Ki 520±n/a nM
Citation Jiang, WTucci, FCTran, JAFleck, BAWen, JMarkison, SMarinkovic, DChen, CWArellano, MHoare, SRJohns, MFoster, ACSaunders, JChen, C Pyrrolidinones as potent functional antagonists of the human melanocortin-4 receptor. Bioorg Med Chem Lett17:5610-3 (2007) 
 
Melanocortin receptor 5
Name:Melanocortin receptor 5
Type:Enzyme
Mol. Mass.:36612.92
Organism:Homo sapiens (Human)
Description:P33032
Residue:325
BDBM50221119
NameBDBM50221119
Synonyms:CHEMBL236521 N-[(1S)-1-[2-[4-[(2R)-3-(2,4-dichlorophenyl)-2-(2-oxo-1-pyrrolidinyl)propionyl]-1-piperazinyl]-5-methylphenyl]-3-methylbutyl]-3-(dimethylamino)propanamide
TypeSmall organic molecule
Emp. Form.C34H47Cl2N5O3
Mol. Mass.644.675
SMILESCC(C)C[C@H](NC(=O)CCN(C)C)c1cc(C)ccc1N1CCN(CC1)C(=O)[C@@H](Cc1ccc(Cl)cc1Cl)N1CCCC1=O