Reaction Details
TargetCannabinoid receptor 2
LigandBDBM50221712
Substrate/Competitorn/a
Meas. Tech.ChEMBL_457680 (CHEMBL925003)
Ki 257.33±n/a nM
Citation Bourne, CRoy, SWiley, JLMartin, BRThomas, BFMahadevan, ARazdan, RK Novel, potent THC/anandamide (hybrid) analogs. Bioorg Med Chem15:7850-64 (2007) 
 
Cannabinoid receptor 2
Name:Cannabinoid receptor 2
Type:G Protein-Coupled Receptor (GPCR)
Mol. Mass.:39690.94
Organism:Homo sapiens (Human)
Description:P34972
Residue:360
BDBM50221712
NameBDBM50221712
Synonyms:12-[2-(1,1-dimethylheptyl)phenyl]dodeca-5,8,11-trienoic acid [R-(1-hydroxypropan-2-yl)]-amide | CHEMBL393343
TypeSmall organic molecule
Emp. Form.C30H47NO2
Mol. Mass.453.6997
SMILESCCCCCCC(C)(C)c1ccccc1\C=C/C\C=C/C\C=C/CCCC(=O)N[C@H](C)CO