Reaction Details
TargetATP-dependent translocase ABCB1
LigandBDBM50221842
Substrate/Competitorn/a
Meas. Tech.ChEMBL_446267 (CHEMBL895371)
Ki 1500±n/a nM
Citation Reyes, CPMuñoz-Martínez, FTorrecillas, IRMendoza, CRGamarro, FBazzocchi, ILNúñez, MJPardo, LCastanys, SCampillo, MJiménez, IA Biological evaluation, structure-activity relationships, and three-dimensional quantitative structure-activity relationship studies of dihydro-beta-agarofuran sesquiterpenes as modulators of P-glycoprotein-dependent multidrug resistance. J Med Chem50:4808-17 (2007) 
 
ATP-dependent translocase ABCB1
Name:ATP-dependent translocase ABCB1
Type:Protein
Mol. Mass.:141503.50
Organism:Homo sapiens (Human)
Description:P08183
Residue:1280
BDBM50221842
NameBDBM50221842
Synonyms:(1S,2R,4S,5R,6R,7S,9R,12R)-4,5-bis(acetyloxy)-6-[(acetyloxy)methyl]-7-(benzoyloxy)-2-hydroxy-2,10,10-trimethyl-11-oxatricyclo[7.2.1.0^{1,6}]dodecan-12-yl benzoate | CHEMBL394978
TypeSmall organic molecule
Emp. Form.C35H40O12
Mol. Mass.652.6849
SMILESCC(=O)OC[C@]12[C@H](C[C@@H]3[C@@H](OC(=O)c4ccccc4)[C@]1(OC3(C)C)[C@](C)(O)C[C@H](OC(C)=O)[C@@H]2OC(C)=O)OC(=O)c1ccccc1