Reaction Details
TargetATP-dependent translocase ABCB1
LigandBDBM50169012
Substrate/Competitorn/a
Meas. Tech.ChEMBL_446267 (CHEMBL895371)
Ki 2540±n/a nM
Citation Reyes, CPMuñoz-Martínez, FTorrecillas, IRMendoza, CRGamarro, FBazzocchi, ILNúñez, MJPardo, LCastanys, SCampillo, MJiménez, IA Biological evaluation, structure-activity relationships, and three-dimensional quantitative structure-activity relationship studies of dihydro-beta-agarofuran sesquiterpenes as modulators of P-glycoprotein-dependent multidrug resistance. J Med Chem50:4808-17 (2007) 
 
ATP-dependent translocase ABCB1
Name:ATP-dependent translocase ABCB1
Type:Protein
Mol. Mass.:141503.50
Organism:Homo sapiens (Human)
Description:P08183
Residue:1280
BDBM50169012
NameBDBM50169012
Synonyms:Benzoic acid (1S,2R,4S,5R,6S,7S,9R,12R)-4,5,12-triacetoxy-6-acetoxymethyl-2,10,10-trimethyl-8-oxo-11-oxa-tricyclo[7.2.1.0*1,6*]dodec-7-yl ester | CHEMBL190069
TypeSmall organic molecule
Emp. Form.C30H36O12
Mol. Mass.588.5996
SMILESC[C@@H]1C[C@H](OC(C)=O)[C@H](OC(C)=O)[C@@]2(COC(C)=O)[C@H](OC(=O)c3ccccc3)C(=O)[C@@H]3[C@@H](OC(C)=O)[C@]12OC3(C)C