Reaction Details
TargetATP-dependent translocase ABCB1
LigandBDBM50221871
Substrate/Competitorn/a
Meas. Tech.ChEMBL_446267 (CHEMBL895371)
Ki 1830±n/a nM
Citation Reyes, CPMuñoz-Martínez, FTorrecillas, IRMendoza, CRGamarro, FBazzocchi, ILNúñez, MJPardo, LCastanys, SCampillo, MJiménez, IA Biological evaluation, structure-activity relationships, and three-dimensional quantitative structure-activity relationship studies of dihydro-beta-agarofuran sesquiterpenes as modulators of P-glycoprotein-dependent multidrug resistance. J Med Chem50:4808-17 (2007) 
 
ATP-dependent translocase ABCB1
Name:ATP-dependent translocase ABCB1
Type:Protein
Mol. Mass.:141503.50
Organism:Homo sapiens (Human)
Description:P08183
Residue:1280
BDBM50221871
NameBDBM50221871
Synonyms:CHEMBL437009 | benzoic acid (1S,2R,5S,6S,7S,8R,9R,12R)-5,12-diacetoxy-6-acetoxymethyl-2-hydroxy-2,10,10-trimethyl-8-pentyloxy-11-oxa-tricyclo[7.2.1.0*1,6*]dodec-7-yl ester
TypeSmall organic molecule
Emp. Form.C33H46O11
Mol. Mass.618.7117
SMILESCCCCCO[C@@H]1[C@@H]2[C@@H](OC(C)=O)[C@]3(OC2(C)C)[C@](C)(O)CC[C@H](OC(C)=O)[C@@]3(COC(C)=O)[C@@H]1OC(=O)c1ccccc1