Reaction Details
TargetPolyunsaturated fatty acid lipoxygenase ALOX15B
LigandBDBM50222282
Substrate/Competitorn/a
Meas. Tech.ChEMBL_457827 (CHEMBL924097)
IC50>100000±n/a nM
Citation Vasquez-Martinez, YOhri, RVKenyon, VHolman, TRSepúlveda-Boza, S Structure-activity relationship studies of flavonoids as potent inhibitors of human platelet 12-hLO, reticulocyte 15-hLO-1, and prostate epithelial 15-hLO-2. Bioorg Med Chem15:7408-25 (2007) 
 
Polyunsaturated fatty acid lipoxygenase ALOX15B
Name:Polyunsaturated fatty acid lipoxygenase ALOX15B
Type:Protein
Mol. Mass.:75850.40
Organism:Homo sapiens (Human)
Description:n/a
Residue:676
BDBM50222282
NameBDBM50222282
Synonyms:3-hydroxy-2-t-butyl-4H-benzopyran-4-one | CHEMBL239023
TypeSmall organic molecule
Emp. Form.C13H14O3
Mol. Mass.218.2485
SMILESCC(C)(C)c1oc2ccccc2c(=O)c1O