Reaction Details
TargetPolyunsaturated fatty acid lipoxygenase ALOX12
LigandBDBM50222279
Substrate/Competitorn/a
Meas. Tech.ChEMBL_457824 (CHEMBL924094)
IC50 5800±n/a nM
Citation Vasquez-Martinez, YOhri, RVKenyon, VHolman, TRSepúlveda-Boza, S Structure-activity relationship studies of flavonoids as potent inhibitors of human platelet 12-hLO, reticulocyte 15-hLO-1, and prostate epithelial 15-hLO-2. Bioorg Med Chem15:7408-25 (2007) 
 
Polyunsaturated fatty acid lipoxygenase ALOX12
Name:Polyunsaturated fatty acid lipoxygenase ALOX12
Type:Protein
Mol. Mass.:75689.18
Organism:Homo sapiens (Human)
Description:P18054
Residue:663
BDBM50222279
NameBDBM50222279
Synonyms:6,7-dihydroxy-4'-nitroisoflavone | CHEMBL238821
TypeSmall organic molecule
Emp. Form.C15H9NO7
Mol. Mass.315.2345
SMILESOc1cc2occ(-c3ccc(c(O)c3)[N+]([O-])=O)c(=O)c2cc1O