Reaction Details
TargetPolyunsaturated fatty acid lipoxygenase ALOX15
LigandBDBM50139862
Substrate/Competitorn/a
Meas. Tech.ChEMBL_457825 (CHEMBL924095)
IC50 510±n/a nM
Citation Vasquez-Martinez, YOhri, RVKenyon, VHolman, TRSepúlveda-Boza, S Structure-activity relationship studies of flavonoids as potent inhibitors of human platelet 12-hLO, reticulocyte 15-hLO-1, and prostate epithelial 15-hLO-2. Bioorg Med Chem15:7408-25 (2007) 
 
Polyunsaturated fatty acid lipoxygenase ALOX15
Name:Polyunsaturated fatty acid lipoxygenase ALOX15
Type:Protein
Mol. Mass.:74804.05
Organism:Homo sapiens (Human)
Description:n/a
Residue:662
BDBM50139862
NameBDBM50139862
Synonyms:3-(4-Hydroxy-phenyl)-chroman-6,7-diol CHEMBL8328 | HIR-1
TypeSmall organic molecule
Emp. Form.C15H14O4
Mol. Mass.258.2693
SMILESOc1ccc(cc1)C1COc2cc(O)c(O)cc2C1