Reaction Details
TargetIntegrin alpha-V/beta-3
LigandBDBM50222359
Substrate/Competitorn/a
Meas. Tech.ChEMBL_449873 (CHEMBL898977)
IC50 38±n/a nM
Citation Benfatti, FCardillo, GFabbroni, SGalzerano, PGentilucci, LJuris, RTolomelli, ABaiula, MSpartà, ASpampinato, S Synthesis and biological evaluation of non-peptide alpha(v)beta(3)/alpha(5)beta(1) integrin dual antagonists containing 5,6-dihydropyridin-2-one scaffolds. Bioorg Med Chem15:7380-90 (2007) 
 
Integrin alpha-V/beta-3
Name:Integrin alpha-V/beta-3
Type:Enzyme
Mol. Mass.:n/a
Description:n/a
Components:This complex has 2 components.
Component 1
Name:Integrin alpha-V
Synonyms:ITAV_HUMAN Integrin alpha-V/alpha-5 VNRA Vitronectin receptor | Vitronectin receptor subunit alpha
Type:PROTEIN
Mol. Mass.:116024.92
Organism:Homo sapiens (Human)
Description:ChEMBL_582336
Residue:1048
Component 2
Name:Integrin beta-3
Synonyms:CD_antigen=CD61 GPIIIa ITGB3 Platelet membrane glycoprotein IIIa
Type:Protein
Mol. Mass.:87038.91
Organism:Homo sapiens (Human)
Description:P05106
Residue:788
BDBM50222359
NameBDBM50222359
Synonyms:2-{[1-(4-aminobutyl)-4-methyl-2-oxo-6-phenyl-1,2,5,6-tetrahydropyridin-3-yl](propyl)carbamoyl}acetic acid | CHEMBL238660
TypeSmall organic molecule
Emp. Form.C22H31N3O4
Mol. Mass.401.4992
SMILESCCCN(C(=O)CC(O)=O)C1=C(C)CC(N(CCCCN)C1=O)c1ccccc1