Reaction Details
TargetHistone deacetylase 6
LigandBDBM50222729
Substrate/Competitorn/a
Meas. Tech.ChEMBL_457995 (CHEMBL925326)
IC50 43±n/a nM
Citation Shivashimpi, GMAmagai, SKato, TNishino, NMaeda, SNishino, TGYoshida, M Molecular design of histone deacetylase inhibitors by aromatic ring shifting in chlamydocin framework. Bioorg Med Chem15:7830-9 (2007) 
 
Histone deacetylase 6
Name:Histone deacetylase 6
Type:PROTEIN
Mol. Mass.:125762.28
Organism:Mus musculus
Description:ChEMBL_1460074
Residue:1149
BDBM50222729
NameBDBM50222729
Synonyms:CHEMBL391384 | cyclo(-L-Am7(S2Py)-Aib-L-Ph5-D-Pro-)
TypeSmall organic molecule
Emp. Form.C32H43N5O4S2
Mol. Mass.625.845
SMILESCC1(C)NC(=O)[C@H](CCCCCSSc2ccccn2)NC(=O)[C@H]2CCCN2C(=O)[C@H](CCCc2ccccc2)NC1=O