Reaction Details
TargetHistone deacetylase 6
LigandBDBM50222737
Substrate/Competitorn/a
Meas. Tech.ChEMBL_457995 (CHEMBL925326)
IC50 29±n/a nM
Citation Shivashimpi, GMAmagai, SKato, TNishino, NMaeda, SNishino, TGYoshida, M Molecular design of histone deacetylase inhibitors by aromatic ring shifting in chlamydocin framework. Bioorg Med Chem15:7830-9 (2007) 
 
Histone deacetylase 6
Name:Histone deacetylase 6
Type:PROTEIN
Mol. Mass.:125762.28
Organism:Mus musculus
Description:ChEMBL_1460074
Residue:1149
BDBM50222737
NameBDBM50222737
Synonyms:CHEMBL238587 | cyclo(-L-Am7(S2Py)-Aib-L-Ala-D-Tic-)
TypeSmall organic molecule
Emp. Form.C29H39N5O3S2
Mol. Mass.569.782
SMILESC[C@H]1CN2Cc3ccccc3C[C@@H]2C(=O)N[C@@H](CCCCCSSc2ccccn2)C(=O)NC(C)(C)C(=O)N1