Reaction Details
TargetHistone deacetylase 1
LigandBDBM50222732
Substrate/Competitorn/a
Meas. Tech.ChEMBL_457993 (CHEMBL925324)
IC50 3.9±n/a nM
Citation Shivashimpi, GMAmagai, SKato, TNishino, NMaeda, SNishino, TGYoshida, M Molecular design of histone deacetylase inhibitors by aromatic ring shifting in chlamydocin framework. Bioorg Med Chem15:7830-9 (2007) 
 
Histone deacetylase 1
Name:Histone deacetylase 1
Type:Enzyme
Mol. Mass.:55090.27
Organism:Homo sapiens (Human)
Description:Q13547
Residue:482
BDBM50222732
NameBDBM50222732
Synonyms:(5S,11S,13aR)-5-benzyl-8,8-dimethyl-11-[5-(pyridin-2-yldisulfanyl)-pentyl]-decahydro-3a,6,9,12-tetraaza-cyclopentacyclododecene-4,7,10,13-tetraone cyclo(-L-Am7(S2Py)-Aib-L-Phe-D-Pro-)
TypeSmall organic molecule
Emp. Form.C30H39N5O4S2
Mol. Mass.597.792
SMILESCC1(C)NC(=O)[C@H](CCCCCSSc2ccccn2)NC(=O)[C@H]2CCCN2C(=O)[C@H](Cc2ccccc2)NC1=O