Reaction Details
TargetHistone deacetylase 1
LigandBDBM50222731
Substrate/Competitorn/a
Meas. Tech.ChEMBL_457993 (CHEMBL925324)
IC50 170±n/a nM
Citation Shivashimpi, GMAmagai, SKato, TNishino, NMaeda, SNishino, TGYoshida, M Molecular design of histone deacetylase inhibitors by aromatic ring shifting in chlamydocin framework. Bioorg Med Chem15:7830-9 (2007) 
 
Histone deacetylase 1
Name:Histone deacetylase 1
Type:Enzyme
Mol. Mass.:55090.27
Organism:Homo sapiens (Human)
Description:Q13547
Residue:482
BDBM50222731
NameBDBM50222731
Synonyms:CHEMBL393261 | cyclo(-L-Am7(S2Py)-D-2MePhe-L-Ala-D-Pro-)
TypeSmall organic molecule
Emp. Form.C30H39N5O4S2
Mol. Mass.597.792
SMILESC[C@@H]1NC(=O)[C@@](C)(Cc2ccccc2)NC(=O)[C@H](CCCCCSSc2ccccn2)NC(=O)[C@H]2CCCN2C1=O